Reaction Details
TargetUrokinase-type plasminogen activator
LigandBDBM50147085
Substrate/Competitorn/a
Meas. Tech.Abbott uPA__Urokinase Human - Ki(uM)
pH7.4±n/a
Temperature298.15±n/a K
Ki 630±n/a nM
Citation CSARdock, CD UROKINASE in CSAR_FULL_RELEASE_3JULY2012 CSAR1:0 (2012)  
 
Urokinase-type plasminogen activator
Name:Urokinase-type plasminogen activator
Type:Enzyme
Mol. Mass.:48528.62
Organism:Homo sapiens (Human)
Description:P00749
Residue:431
BDBM50147085
NameBDBM50147085
Synonyms:7-METHOXY-8-[1-(METHYLSULFONYL)-1H-PYRAZOL-4-YL]NAPHTHALENE-2-CARBOXIMIDAMIDE 8-(1-Methanesulfonyl-1H-pyrazol-4-yl)-7-methoxy-naphthalene-2-carboxamidine uPa_13
TypeSmall organic molecule
Emp. Form.C16H16N4O3S
Mol. Mass.344.388
SMILESCOc1ccc2ccc(cc2c1-c1cnn(c1)S(C)(=O)=O)C(N)=N