Reaction Details
TargetUrokinase-type plasminogen activator
LigandBDBM50138670
Substrate/Competitorn/a
Meas. Tech.Abbott uPA__Urokinase Human - Ki(uM)
pH7.4±n/a
Temperature298.15±n/a K
Ki 628±n/a nM
Citation CSARdock, CD UROKINASE in CSAR_FULL_RELEASE_3JULY2012 CSAR1:0 (2012)  
 
Urokinase-type plasminogen activator
Name:Urokinase-type plasminogen activator
Type:Enzyme
Mol. Mass.:48528.62
Organism:Homo sapiens (Human)
Description:P00749
Residue:431
BDBM50138670
NameBDBM50138670
Synonyms:6-Carbamimidoyl-naphthalene-2-carboxylic acid phenylamide 6-carbamimidoyl-N-phenyl-2-naphthamide uPa_7
TypeSmall organic molecule
Emp. Form.C18H15N3O
Mol. Mass.289.3312
SMILESNC(=N)c1ccc2cc(ccc2c1)C(=O)Nc1ccccc1