Reaction Details
TargetDual specificity calcium/calmodulin-dependent 3',5'-cyclic nucleotide phosphodiesterase 1C
LigandBDBM279002
Substrate/Competitorn/a
Meas. Tech.PDE1 Inhibition Assay
pH7.6±n/a
Temperature298.15±n/a K
IC50 6.20±n/a nM
Commentsextracted
Citation Kehler, JJuhl, KMarigo, MVital, PJJessing, MLanggård, MRasmussen, LKClementson, CM 1H-pyrazolo[4,3-b]pyridines as PDE1 inhibitors US Patent US10034861 Publication Date 7/31/2018
 
Dual specificity calcium/calmodulin-dependent 3',5'-cyclic nucleotide phosphodiesterase 1C
Name:Dual specificity calcium/calmodulin-dependent 3',5'-cyclic nucleotide phosphodiesterase 1C
Type:Enzyme
Mol. Mass.:80778.58
Organism:Homo sapiens (Human)
Description:Q14123
Residue:709
BDBM279002
NameBDBM279002
Synonyms:5-(2-ethoxy-3-pyridyl)-1-isopropyl-3-methyl-N-[(2-methylthiazol-5-yl)methyl]pyrazolo[4,3-b]pyridin-7-amine US10512632, Example 32 US10806718, Example 32 US11491140, Example 32 | US11634416, Example 32
TypeSmall organic molecule
Emp. Form.C22H26N6OS
Mol. Mass.422.546
SMILESCCOc1ncccc1-c1cc(NCc2cnc(C)s2)c2n(nc(C)c2n1)C(C)C