Reaction Details
TargetDual specificity calcium/calmodulin-dependent 3',5'-cyclic nucleotide phosphodiesterase 1B
LigandBDBM279044
Substrate/Competitorn/a
Meas. Tech.PDE1 Inhibition Assay
pH7.6±n/a
Temperature298.15±n/a K
IC50 0.340±n/a nM
Commentsextracted
Citation Kehler, JJuhl, KMarigo, MVital, PJJessing, MLanggård, MRasmussen, LKClementson, CM 1H-pyrazolo[4,3-b]pyridines as PDE1 inhibitors US Patent US10034861 Publication Date 7/31/2018
 
Dual specificity calcium/calmodulin-dependent 3',5'-cyclic nucleotide phosphodiesterase 1B
Name:Dual specificity calcium/calmodulin-dependent 3',5'-cyclic nucleotide phosphodiesterase 1B
Type:Enzyme
Mol. Mass.:61366.51
Organism:Homo sapiens (Human)
Description:n/a
Residue:536
BDBM279044
NameBDBM279044
Synonyms:5-(2-ethoxy-3-pyridyl)-1-isopropyl-3-methyl-N-(pyrimidin-2-ylmethyl)pyrazolo[4,3-b]pyridin-7-amine US10512632, Example 74 US10806718, Example 74 US11634416, Example 74
TypeSmall organic molecule
Emp. Form.C22H25N7O
Mol. Mass.403.4802
SMILESCCOc1ncccc1-c1cc(NCc2ncccn2)c2n(nc(C)c2n1)C(C)C