Reaction Details
TargetDual specificity calcium/calmodulin-dependent 3',5'-cyclic nucleotide phosphodiesterase 1C
LigandBDBM279066
Substrate/Competitorn/a
Meas. Tech.PDE1 Inhibition Assay
pH7.6±n/a
Temperature298.15±n/a K
IC50 9.10±n/a nM
Commentsextracted
Citation Kehler, JJuhl, KMarigo, MVital, PJJessing, MLanggård, MRasmussen, LKClementson, CM 1H-pyrazolo[4,3-b]pyridines as PDE1 inhibitors US Patent US10034861 Publication Date 7/31/2018
 
Dual specificity calcium/calmodulin-dependent 3',5'-cyclic nucleotide phosphodiesterase 1C
Name:Dual specificity calcium/calmodulin-dependent 3',5'-cyclic nucleotide phosphodiesterase 1C
Type:Enzyme
Mol. Mass.:80778.58
Organism:Homo sapiens (Human)
Description:Q14123
Residue:709
BDBM279066
NameBDBM279066
Synonyms:5-(2-isopropoxy-3-pyridyl)-1-isopropyl-3-methyl-N-[(1-methylpyrazol-4-yl)methyl]pyrazolo[4,3-b]pyridin-7-amine US10512632, Example 97 US10806718, Example 97 US11491140, Example 97 | US11634416, Example 97
TypeSmall organic molecule
Emp. Form.C23H29N7O
Mol. Mass.419.5227
SMILESCC(C)Oc1ncccc1-c1cc(NCc2cnn(C)c2)c2n(nc(C)c2n1)C(C)C