Reaction Details
TargetDual specificity calcium/calmodulin-dependent 3',5'-cyclic nucleotide phosphodiesterase 1A
LigandBDBM279077
Substrate/Competitorn/a
Meas. Tech.PDE1 Inhibition Assay
pH7.6±n/a
Temperature298.15±n/a K
IC50 2.80±n/a nM
Commentsextracted
Citation Kehler, JJuhl, KMarigo, MVital, PJJessing, MLanggård, MRasmussen, LKClementson, CM 1H-pyrazolo[4,3-b]pyridines as PDE1 inhibitors US Patent US10034861 Publication Date 7/31/2018
 
Dual specificity calcium/calmodulin-dependent 3',5'-cyclic nucleotide phosphodiesterase 1A
Name:Dual specificity calcium/calmodulin-dependent 3',5'-cyclic nucleotide phosphodiesterase 1A
Type:Protein
Mol. Mass.:61245.69
Organism:Homo sapiens (Human)
Description:P54750
Residue:535
BDBM279077
NameBDBM279077
Synonyms:3-[[[5-(2-ethoxy-3-pyridyl)-1-isopropyl-3-methyl-pyrazolo[4,3-b]pyridin-7-yl]amino]methyl]-1-methyl-pyridin-2-one US10512632, Example 108 US10806718, Example 108 US11491140, Example 108 | US11634416, Example 108
TypeSmall organic molecule
Emp. Form.C24H28N6O2
Mol. Mass.432.5181
SMILESCCOc1ncccc1-c1cc(NCc2cccn(C)c2=O)c2n(nc(C)c2n1)C(C)C