Reaction Details
TargetDual specificity calcium/calmodulin-dependent 3',5'-cyclic nucleotide phosphodiesterase 1C
LigandBDBM279097
Substrate/Competitorn/a
Meas. Tech.PDE1 Inhibition Assay
pH7.6±n/a
Temperature298.15±n/a K
IC50 4.10±n/a nM
Commentsextracted
Citation Kehler, JJuhl, KMarigo, MVital, PJJessing, MLanggård, MRasmussen, LKClementson, CM 1H-pyrazolo[4,3-b]pyridines as PDE1 inhibitors US Patent US10034861 Publication Date 7/31/2018
 
Dual specificity calcium/calmodulin-dependent 3',5'-cyclic nucleotide phosphodiesterase 1C
Name:Dual specificity calcium/calmodulin-dependent 3',5'-cyclic nucleotide phosphodiesterase 1C
Type:Enzyme
Mol. Mass.:80778.58
Organism:Homo sapiens (Human)
Description:Q14123
Residue:709
BDBM279097
NameBDBM279097
Synonyms:5-(2-ethoxy-3-pyridyl)-3-methyl-N-[(5-methyl-1,2,4-oxadiazol-3-yl)methyl]-1-[1-methylpropyl]pyrazolo[4,3-b]pyridin-7-amine,enantiomer 2 US10512632, Example 128 US10806718, Example 128 | US11634416, Example 128
TypeSmall organic molecule
Emp. Form.C22H27N7O2
Mol. Mass.421.4955
SMILESCCOc1ncccc1-c1cc(NCc2noc(C)n2)c2n(nc(C)c2n1)C(C)CC