Reaction Details
TargetDual specificity calcium/calmodulin-dependent 3',5'-cyclic nucleotide phosphodiesterase 1C
LigandBDBM279100
Substrate/Competitorn/a
Meas. Tech.PDE1 Inhibition Assay
pH7.6±n/a
Temperature298.15±n/a K
IC50 0.460±n/a nM
Commentsextracted
Citation Kehler, JJuhl, KMarigo, MVital, PJJessing, MLanggård, MRasmussen, LKClementson, CM 1H-pyrazolo[4,3-b]pyridines as PDE1 inhibitors US Patent US10034861 Publication Date 7/31/2018
 
Dual specificity calcium/calmodulin-dependent 3',5'-cyclic nucleotide phosphodiesterase 1C
Name:Dual specificity calcium/calmodulin-dependent 3',5'-cyclic nucleotide phosphodiesterase 1C
Type:Enzyme
Mol. Mass.:80778.58
Organism:Homo sapiens (Human)
Description:Q14123
Residue:709
BDBM279100
NameBDBM279100
Synonyms:5-(2-ethoxy-3-pyridyl)-3-methyl-1-[1-methylpropyl]-N-[(5-methyl-1H-pyrazol-3-yl)methyl]pyrazolo[4,3-b]pyridin-7-amine,enantiomer 2 US10512632, Example 131 US10806718, Example 131 | US11634416, Example 131
TypeSmall organic molecule
Emp. Form.C23H29N7O
Mol. Mass.419.5227
SMILESCCOc1ncccc1-c1cc(NCc2cc(C)[nH]n2)c2n(nc(C)c2n1)C(C)CC