Reaction Details
TargetDual specificity calcium/calmodulin-dependent 3',5'-cyclic nucleotide phosphodiesterase 1A
LigandBDBM279114
Substrate/Competitorn/a
Meas. Tech.PDE1 Inhibition Assay
pH7.6±n/a
Temperature298.15±n/a K
IC50 0.410±n/a nM
Commentsextracted
Citation Kehler, JJuhl, KMarigo, MVital, PJJessing, MLanggård, MRasmussen, LKClementson, CM 1H-pyrazolo[4,3-b]pyridines as PDE1 inhibitors US Patent US10034861 Publication Date 7/31/2018
 
Dual specificity calcium/calmodulin-dependent 3',5'-cyclic nucleotide phosphodiesterase 1A
Name:Dual specificity calcium/calmodulin-dependent 3',5'-cyclic nucleotide phosphodiesterase 1A
Type:Protein
Mol. Mass.:61245.69
Organism:Homo sapiens (Human)
Description:P54750
Residue:535
BDBM279114
NameBDBM279114
Synonyms:1-isopropyl-3-methyl-N-[(1-methyl-1,2,4-triazol-3-yl)methyl]-5-(2-propoxy-3-pyridyl)pyrazolo[4,3-b]pyridin-7-amine US10512632, Example 145 US10806718, Example 145 US11491140, Example 145 | US11634416, Example 145
TypeSmall organic molecule
Emp. Form.C22H28N8O
Mol. Mass.420.5107
SMILESCCCOc1ncccc1-c1cc(NCc2ncn(C)n2)c2n(nc(C)c2n1)C(C)C