Reaction Details
TargetDual specificity calcium/calmodulin-dependent 3',5'-cyclic nucleotide phosphodiesterase 1B
LigandBDBM279158
Substrate/Competitorn/a
Meas. Tech.PDE1 Inhibition Assay
pH7.6±n/a
Temperature298.15±n/a K
IC50 0.490±n/a nM
Commentsextracted
Citation Kehler, JJuhl, KMarigo, MVital, PJJessing, MLanggård, MRasmussen, LKClementson, CM 1H-pyrazolo[4,3-b]pyridines as PDE1 inhibitors US Patent US10034861 Publication Date 7/31/2018
 
Dual specificity calcium/calmodulin-dependent 3',5'-cyclic nucleotide phosphodiesterase 1B
Name:Dual specificity calcium/calmodulin-dependent 3',5'-cyclic nucleotide phosphodiesterase 1B
Type:Enzyme
Mol. Mass.:61366.51
Organism:Homo sapiens (Human)
Description:n/a
Residue:536
BDBM279158
NameBDBM279158
Synonyms:5-(2-ethoxy-3-pyridyl)-1-isopropyl-N-[(4-methoxypyrimidin-2-yl)methyl]-3-methyl-pyrazolo[4,3-b]pyridin-7-amine US10512632, Example 189 US10806718, Example 189 US11491140, Example 189 | US11634416, Example 189
TypeSmall organic molecule
Emp. Form.C23H27N7O2
Mol. Mass.433.5062
SMILESCCOc1ncccc1-c1cc(NCc2nccc(OC)n2)c2n(nc(C)c2n1)C(C)C