Reaction Details
TargetPhosphodiesterase
LigandBDBM15296
Substrate/Competitorn/a
Meas. Tech.Enzymatic Assay
pH7.5±0
Temperature297.15±0 K
IC50>1.00e+5±n/a nM
Citation Wang, HKunz, SChen, GSeebeck, TWan, YRobinson, HMartinelli, SKe, H Biological and structural characterization of Trypanosoma cruzi phosphodiesterase C and Implications for design of parasite selective inhibitors. J Biol Chem287:11788-97 (2012) 
 
Phosphodiesterase
Name:Phosphodiesterase
Type:Protein
Mol. Mass.:103074.59
Organism:Trypanosoma cruzi
Description:Q53I59
Residue:924
BDBM15296
NameBDBM15296
Synonyms:6-methyl-2-oxo-5-(pyridin-4-yl)-1,2-dihydropyridine-3-carbonitrile CHEMBL189 Primacor US9249139, Milrinone
TypeSmall organic molecule
Emp. Form.C12H9N3O
Mol. Mass.211.2194
SMILESCc1[nH]c(=O)c(cc1-c1ccncc1)C#N