Reaction Details
TargetPhosphodiesterase
LigandBDBM14361
Substrate/Competitorn/a
Meas. Tech.Enzymatic Assay
pH7.5±0
Temperature297.15±0 K
IC50>1.00e+5±n/a nM
Citation Wang, HKunz, SChen, GSeebeck, TWan, YRobinson, HMartinelli, SKe, H Biological and structural characterization of Trypanosoma cruzi phosphodiesterase C and Implications for design of parasite selective inhibitors. J Biol Chem287:11788-97 (2012) 
 
Phosphodiesterase
Name:Phosphodiesterase
Type:Protein
Mol. Mass.:103074.59
Organism:Trypanosoma cruzi
Description:Q53I59
Residue:924
BDBM14361
NameBDBM14361
Synonyms:(R,S)-Rolipram 4-[3-(cyclopentyloxy)-4-methoxyphenyl]pyrrolidin-2-one CHEMBL63 | Rolipram
TypeSmall organic molecule
Emp. Form.C16H21NO3
Mol. Mass.275.3428
SMILESCOc1ccc(cc1OC1CCCC1)C1CNC(=O)C1