Reaction Details
TargetHypoxanthine-guanine-xanthine phosphoribosyltransferase
LigandBDBM92358
Substrate/Competitorn/a
Meas. Tech.Inhbition Assay
pH7.6±0
Temperature310.15±0 K
Ki 0.65±0.04 nM
Citation Hazleton, KZHo, MCCassera, MBClinch, KCrump, DRRosario, IMerino, EFAlmo, SCTyler, PCSchramm, VL Acyclic Immucillin Phosphonates: Second-Generation Inhibitors of Plasmodium falciparum Hypoxanthine- Guanine-Xanthine Phosphoribosyltransferase. Chem Biol19:721-30 (2012) 
 
Hypoxanthine-guanine-xanthine phosphoribosyltransferase
Name:Hypoxanthine-guanine-xanthine phosphoribosyltransferase
Type:Protein
Mol. Mass.:26352.14
Organism:Plasmodium falciparum
Description:P20035
Residue:231
BDBM92358
NameBDBM92358
Synonyms:HGXPRT Inhibitor, 3
TypeSmall organic molecule
Emp. Form.C10H14N4O5P
Mol. Mass.301.2163
SMILESOC[C@H](CCP([O-])([O-])=O)[NH2+]c1c[nH]c2c1nc[nH]c2=O