Reaction Details
TargetDual specificity mitogen-activated protein kinase kinase 6
LigandBDBM29674
Substrate/Competitorn/a
Meas. Tech.Fluorescence Polarization (FP) Assay
IC50>2.50e+5±n/a nM
Citation Bannwarth, LGoldberg, ABChen, CTurk, BE Identification of exosite-targeting inhibitors of anthrax lethal factor by high-throughput screening. Chem Biol19:875-82 (2012) 
 
Dual specificity mitogen-activated protein kinase kinase 6
Name:Dual specificity mitogen-activated protein kinase kinase 6
Type:Protein
Mol. Mass.:37494.96
Organism:Homo sapiens (Human)
Description:P52564
Residue:334
BDBM29674
NameBDBM29674
Synonyms:Reduced stictic acid, 8
TypeSmall organic molecule
Emp. Form.C19H16O9
Mol. Mass.388.3249
SMILESCOc1cc(C)c2c(Oc3c4C(O)OC(=O)c4c(O)c(C)c3OC2=O)c1CO