Reaction Details
TargetPancreatic alpha-amylase
LigandBDBM92366
Substrate/Competitorn/a
Meas. Tech.Enzymatic Activity Assay
pH7±0
Temperature310.15±0 K
Ki 2.04e+5± 7.2e+4 nM
IC50 8.89e+4± 6.0e+3 nM
Citation Senger, MRGomes, Lda CFerreira, SBKaiser, CRFerreira, VFSilva, FP Kinetics Studies on the Inhibition Mechanism of Pancreatic α-Amylase by Glycoconjugated 1H-1,2,3-Triazoles: A New Class of Inhibitors with Hypoglycemiant Activity. Chembiochem13:1584-93 (2012) 
 
Pancreatic alpha-amylase
Name:Pancreatic alpha-amylase
Type:Protein
Mol. Mass.:57088.07
Organism:Sus scrofa (Pig)
Description:P00690
Residue:511
BDBM92366
NameBDBM92366
Synonyms:GPESB14
TypeSmall organic molecule
Emp. Form.C13H15N3O4
Mol. Mass.277.2759
SMILESO[C@@H]1O[C@H](Cn2cc(nn2)-c2ccccc2)[C@H](O)C1O