Reaction Details
TargetPancreatic alpha-amylase
LigandBDBM92367
Substrate/Competitorn/a
Meas. Tech.Enzymatic Activity Assay
pH7±0
Temperature310.15±0 K
Ki 3.36e+4± 5.0e+3 nM
IC50 3.58e+4± 1.9e+3 nM
Citation Senger, MRGomes, Lda CFerreira, SBKaiser, CRFerreira, VFSilva, FP Kinetics Studies on the Inhibition Mechanism of Pancreatic α-Amylase by Glycoconjugated 1H-1,2,3-Triazoles: A New Class of Inhibitors with Hypoglycemiant Activity. Chembiochem13:1584-93 (2012) 
 
Pancreatic alpha-amylase
Name:Pancreatic alpha-amylase
Type:Protein
Mol. Mass.:57088.07
Organism:Sus scrofa (Pig)
Description:P00690
Residue:511
BDBM92367
NameBDBM92367
Synonyms:GPESB15
TypeSmall organic molecule
Emp. Form.C13H19N3O4
Mol. Mass.281.3077
SMILESO[C@@H]1O[C@H](Cn2cc(nn2)C2=CCCCC2)[C@H](O)C1O