Reaction Details
TargetBifunctional purine biosynthesis protein ATIC
LigandBDBM92368
Substrate/Competitorn/a
Meas. Tech.Enzyme Inhibition Assay
Temperature298.15±0 K
Ki 8.4e+4± 7e+3 nM
Citation Spurr, IBBirts, CNCuda, FBenkovic, SJBlaydes, JPTavassoli, A Targeting Tumour Proliferation with a Small-Molecule Inhibitor of AICAR Transformylase Homodimerization. Chembiochem13:1628-34 (2012) 
 
Bifunctional purine biosynthesis protein ATIC
Name:Bifunctional purine biosynthesis protein ATIC
Type:Protein
Mol. Mass.:64616.62
Organism:Homo sapiens (Human)
Description:P31939
Residue:592
BDBM92368
NameBDBM92368
Synonyms:RY Analogue, 8
TypeSmall organic molecule
Emp. Form.C19H30N6O4
Mol. Mass.406.4793
SMILES[#6]-[#6]-[#7]-[#6](=O)-[#6@H](-[#6]-c1ccc(-[#8])cc1)-[#7]-[#6](=O)-[#6@H](-[#6]-[#6]-[#6]\[#7]=[#6](/[#7])-[#7])-[#7]-[#6](-[#6])=O