Reaction Details
TargetBifunctional purine biosynthesis protein ATIC
LigandBDBM92375
Substrate/Competitorn/a
Meas. Tech.Enzyme Inhibition Assay
Temperature298.15±0 K
Ki 1.45e+5± 1.4e+4 nM
Citation Spurr, IBBirts, CNCuda, FBenkovic, SJBlaydes, JPTavassoli, A Targeting Tumour Proliferation with a Small-Molecule Inhibitor of AICAR Transformylase Homodimerization. Chembiochem13:1628-34 (2012) 
 
Bifunctional purine biosynthesis protein ATIC
Name:Bifunctional purine biosynthesis protein ATIC
Type:Protein
Mol. Mass.:64616.62
Organism:Homo sapiens (Human)
Description:P31939
Residue:592
BDBM92375
NameBDBM92375
Synonyms:RY Analogue, 16
TypeSmall organic molecule
Emp. Form.C20H32N6O4
Mol. Mass.420.5059
SMILES[#6]-[#6]-[#7]-[#6](=O)-[#6@H](-[#6]-c1ccc(-[#8])cc1)-[#7](-[#6])-[#6](=O)-[#6@H](-[#6]-[#6]-[#6]\[#7]=[#6](/[#7])-[#7])-[#7]-[#6](-[#6])=O