Reaction Details
TargetNeuronal acetylcholine receptor subunit alpha-4
LigandBDBM50004108
Substrate/Competitorn/a
Meas. Tech.Radioligand Competition Assay
Ki 6.0±3.4 nM
Citation Rohde, LAAhring, PKJensen, MLNielsen, EØPeters, DHelgstrand, CKrintel, CHarpsøe, KGajhede, MKastrup, JSBalle, T Intersubunit bridge formation governs agonist efficacy at nicotinic acetylcholine α4β2 receptors: unique role of halogen bonding revealed. J Biol Chem287:4248-59 (2012) 
 
Neuronal acetylcholine receptor subunit alpha-4
Name:Neuronal acetylcholine receptor subunit alpha-4
Type:Enzyme
Mol. Mass.:70196.44
Organism:Rattus norvegicus (Rat)
Description:P09483
Residue:630
BDBM50004108
NameBDBM50004108
Synonyms:(+-)-nicotine (RS)-nicotine CHEMBL440464 Nicotine-(+) US11667638, Example Nicotine US9284322, Nicotine nicotine
TypeSmall organic molecule
Emp. Form.C10H14N2
Mol. Mass.162.2316
SMILESCN1CCCC1c1cccnc1