Reaction Details
TargetAcetylcholine-binding protein
LigandBDBM50143314
Substrate/Competitorn/a
Meas. Tech.Radioligand Competition Assay
Ki 0.097±0 nM
Citation Rohde, LAAhring, PKJensen, MLNielsen, EØPeters, DHelgstrand, CKrintel, CHarpsøe, KGajhede, MKastrup, JSBalle, T Intersubunit bridge formation governs agonist efficacy at nicotinic acetylcholine α4β2 receptors: unique role of halogen bonding revealed. J Biol Chem287:4248-59 (2012) 
 
Acetylcholine-binding protein
Name:Acetylcholine-binding protein
Type:n/a
Mol. Mass.:26055.52
Organism:Lymnaea stagnalis
Description:Soluble acetylcholine receptor
Residue:229
BDBM50143314
NameBDBM50143314
Synonyms:(+)-Epibatidine (1R,2R,4S)-2-(6-Chloro-pyridin-3-yl)-7-aza-bicyclo[2.2.1]heptane CHEMBL298826 | EPIBATIDINE
TypeSmall organic molecule
Emp. Form.C11H13ClN2
Mol. Mass.208.687
SMILESClc1ccc(cn1)[C@H]1C[C@@H]2CC[C@H]1N2