Reaction Details
TargetNeuronal acetylcholine receptor subunit alpha-7
LigandBDBM50088454
Substrate/Competitorn/a
Meas. Tech.Radioligand Competition Assay
Ki 190±18 nM
Citation Rohde, LAAhring, PKJensen, MLNielsen, EØPeters, DHelgstrand, CKrintel, CHarpsøe, KGajhede, MKastrup, JSBalle, T Intersubunit bridge formation governs agonist efficacy at nicotinic acetylcholine α4β2 receptors: unique role of halogen bonding revealed. J Biol Chem287:4248-59 (2012) 
 
Neuronal acetylcholine receptor subunit alpha-7
Name:Neuronal acetylcholine receptor subunit alpha-7
Type:Enzyme
Mol. Mass.:56502.44
Organism:Rattus norvegicus (Rat)
Description:Q05941
Residue:502
BDBM50088454
NameBDBM50088454
Synonyms:1-(6-Bromo-pyridin-3-yl)-[1,4]diazepane CHEMBL306387 | NS3920, 4
TypeSmall organic molecule
Emp. Form.C10H14BrN3
Mol. Mass.256.142
SMILESBrc1ccc(cn1)N1CCCNCC1