Reaction Details
Target3-phosphoinositide-dependent protein kinase 1
LigandBDBM92404
Substrate/Competitorn/a
Meas. Tech.Proliferation Assay
EC50 9±0.0 nM
Citation Nagashima, KShumway, SDSathyanarayanan, SChen, AHDolinski, BXu, YKeilhack, HNguyen, TWiznerowicz, MLi, LLutterbach, BAChi, APaweletz, CAllison, TYan, YMunshi, SKKlippel, AKraus, MBobkova, EVDeshmukh, SXu, ZMueller, USzewczak, AAPan, BSRichon, VPollock, RBlume-Jensen, PNorthrup, AAndersen, JN Genetic and pharmacological inhibition of PDK1 in cancer cells: characterization of a selective allosteric kinase inhibitor. J Biol Chem286:6433-48 (2011) 
 
3-phosphoinositide-dependent protein kinase 1
Name:3-phosphoinositide-dependent protein kinase 1
Type:Enzyme
Mol. Mass.:63157.65
Organism:Homo sapiens (Human)
Description:O15530
Residue:556
BDBM92404
NameBDBM92404
Synonyms:CHEMBL250843 | PDK1 inhibitor, 5
TypeSmall organic molecule
Emp. Form.C14H15ClN4O
Mol. Mass.290.748
SMILESCc1[nH]nc2c1c(=O)n(CCCN)c1ccc(Cl)cc21