Reaction Details
TargetGenome polyprotein [1027-1206,R1052K]
LigandBDBM92408
Substrate/Competitorn/a
Meas. Tech.Binding Assay
pH8±0
Ki 1.89±0.06 nM
KOFF 22E-4 s-1
KON 11E5 M-1s-1
Citation Lemke, CTGoudreau, NZhao, SHucke, OThibeault, DLlinás-Brunet, MWhite, PW Combined X-ray, NMR, and kinetic analyses reveal uncommon binding characteristics of the hepatitis C virus NS3-NS4A protease inhibitor BI 201335. J Biol Chem286:11434-43 (2011) 
 
Genome polyprotein [1027-1206,R1052K]
Name:Genome polyprotein [1027-1206,R1052K]
Type:Enzyme Subunit
Mol. Mass.:18947.03
Organism:Hepatitis C virus
Description:HCV (BK strain) NS3 protein region from amino acid 1 to 180, harboring a C-terminal poly Lys solubilization motif (ASKKKK).
Residue:180
BDBM92408
NameBDBM92408
Synonyms:NS3 protease inhibitor, analog 1
TypePeptide
Emp. Form.C40H50N6O9S
Mol. Mass.790.925
SMILESCOc1ccc2c(O[C@@H]3CC(N(C3)C(=O)[C@@H](NC(=O)OC3CCCC3)C(C)(C)C)C(=O)N[C@@]3(CC3C=C)C(O)=O)cc(nc2c1)-c1csc(NC(=O)C(C)C)n1