Reaction Details
TargetMatrix metalloproteinase-14
LigandBDBM92448
Substrate/Competitorn/a
Meas. Tech.Enzyme Assay
pH6.8±0
Temperature298.15±0 K
Ki 1054±0.0 nM
Citation Devel, LBeau, FAmoura, MVera, LCassar-Lajeunesse, EGarcia, SCzarny, BStura, EADive, V Simple Pseudo-dipeptides with a P2' Glutamate: A NOVEL INHIBITOR FAMILY OF MATRIX METALLOPROTEASES AND OTHER METZINCINS. J Biol Chem287:26647-56 (2012) 
 
Matrix metalloproteinase-14
Name:Matrix metalloproteinase-14
Type:Protein
Mol. Mass.:65900.19
Organism:Homo sapiens (Human)
Description:P50281
Residue:582
BDBM92448
NameBDBM92448
Synonyms:Inhibitor, 18
TypeSmall organic molecule
Emp. Form.C26H26N2O4
Mol. Mass.430.4956
SMILESNC(=O)[C@H](CCC(O)=O)NC(=O)CCc1ccc(cc1)-c1ccc(cc1)-c1ccccc1