Reaction Details
TargetReceptor tyrosine-protein kinase erbB-2
LigandBDBM92454
Substrate/Competitorn/a
Meas. Tech.Enzyme Assay
pH7.5±0
IC50 11±0 nM
Citation Aertgeerts, KSkene, RYano, JSang, BCZou, HSnell, GJennings, AIwamoto, KHabuka, NHirokawa, AIshikawa, TTanaka, TMiki, HOhta, YSogabe, S Structural analysis of the mechanism of inhibition and allosteric activation of the kinase domain of HER2 protein. J Biol Chem286:18756-65 (2011) 
 
Receptor tyrosine-protein kinase erbB-2
Name:Receptor tyrosine-protein kinase erbB-2
Type:n/a
Mol. Mass.:137894.47
Organism:Homo sapiens (Human)
Description:P04626
Residue:1255
BDBM92454
NameBDBM92454
Synonyms:SYR127063
TypeSmall organic molecule
Emp. Form.C21H16ClF3N5O3
Mol. Mass.478.832
SMILES[O-]CCOCn1ccc2ncnc(Nc3cnc(Oc4cccc(c4)C(F)(F)F)c(Cl)c3)c12