Reaction Details
TargetReceptor tyrosine-protein kinase erbB-2
LigandBDBM5445
Substrate/Competitorn/a
Meas. Tech.Enzyme Assay
pH7.5±0
IC50 13±1 nM
Citation Aertgeerts, KSkene, RYano, JSang, BCZou, HSnell, GJennings, AIwamoto, KHabuka, NHirokawa, AIshikawa, TTanaka, TMiki, HOhta, YSogabe, S Structural analysis of the mechanism of inhibition and allosteric activation of the kinase domain of HER2 protein. J Biol Chem286:18756-65 (2011) 
 
Receptor tyrosine-protein kinase erbB-2
Name:Receptor tyrosine-protein kinase erbB-2
Type:n/a
Mol. Mass.:137894.47
Organism:Homo sapiens (Human)
Description:P04626
Residue:1255
BDBM5445
NameBDBM5445
Synonyms:CHEMBL554 LAPATINIB DITOSYLATE N-{3-chloro-4-[(3-fluoro-benzyl)oxy]phenyl}-6-[5-({2-(methylsulfonyl)ethyl]amino}methyl)-2-furyl]-4-quinazolinamine Tykerb US10822334, Compound Lapatinib cid_208908
TypeSmall organic molecule
Emp. Form.C29H26ClFN4O4S
Mol. Mass.581.058
SMILESCS(=O)(=O)CCNCc1ccc(o1)-c1ccc2ncnc(Nc3ccc(OCc4cccc(F)c4)c(Cl)c3)c2c1