Reaction Details
TargetPhosphoethanolamine N-methyltransferase 1
LigandBDBM8961
Substrate/Competitorn/a
Meas. Tech.Radiochemical Assay
pH8±0
Temperature298.15±0 K
IC50 23400000±500000 nM
Citation Lee, SGHaakenson, WMcCarter, JPWilliams, DJHresko, MCJez, JM Thermodynamic evaluation of ligand binding in the plant-like phosphoethanolamine methyltransferases of the parasitic nematode Haemonchus contortus. J Biol Chem286:38060-8 (2011) 
 
Phosphoethanolamine N-methyltransferase 1
Name:Phosphoethanolamine N-methyltransferase 1
Synonyms:Phosphoehtnaolamine Methyltransferases 1 (PMT1)
Type:Enzyme
Mol. Mass.:53531.36
Organism:Caenorhabditis elegans
Description:Q86NB3
Residue:460
BDBM8961
NameBDBM8961
TypeSmall organic molecule
Emp. Form.C13H14N2
Mol. Mass.198.2637
SMILESNc1c2CCCCc2nc2ccccc12