Reaction Details
TargetPhosphoethanolamine N-methyltransferase 2
LigandBDBM8961
Substrate/Competitorn/a
Meas. Tech.Radiochemical Assay
pH8±0
Temperature298.15±0 K
IC50 3500000±500000 nM
Citation Lee, SGHaakenson, WMcCarter, JPWilliams, DJHresko, MCJez, JM Thermodynamic evaluation of ligand binding in the plant-like phosphoethanolamine methyltransferases of the parasitic nematode Haemonchus contortus. J Biol Chem286:38060-8 (2011) 
 
Phosphoethanolamine N-methyltransferase 2
Name:Phosphoethanolamine N-methyltransferase 2
Synonyms:Phosphoehtnaolamine Methyltransferases 2 (PMT2)
Type:Enzyme
Mol. Mass.:49764.45
Organism:Caenorhabditis elegans
Description:Q22993
Residue:437
BDBM8961
NameBDBM8961
TypeSmall organic molecule
Emp. Form.C13H14N2
Mol. Mass.198.2637
SMILESNc1c2CCCCc2nc2ccccc12