Reaction Details
TargetPlasminogen activator inhibitor 1
LigandBDBM92486
Substrate/Competitorn/a
Meas. Tech.Enzymatic Assay
pH7.8±0
Temperature296.15±0 K
Kd 5.3±0.2 nM
Citation Cale, JMLi, SHWarnock, MSu, EJNorth, PRSanders, KLPuscau, MMEmal, CDLawrence, DA Characterization of a novel class of polyphenolic inhibitors of plasminogen activator inhibitor-1. J Biol Chem285:7892-902 (2010) 
 
Plasminogen activator inhibitor 1
Name:Plasminogen activator inhibitor 1
Type:Enzyme
Mol. Mass.:45064.00
Organism:Homo sapiens (Human)
Description:P05121
Residue:402
BDBM92486
NameBDBM92486
Synonyms:CDE-082 | US9120744, CDE-082
TypeSmall organic molecule
Emp. Form.C24H20O15
Mol. Mass.548.4066
SMILESOc1cc(cc(O)c1O)C(=O)OCC(COC(=O)c1cc(O)c(O)c(O)c1)OC(=O)c1cc(O)c(O)c(O)c1