Reaction Details
TargetMethyl-accepting chemotaxis protein NahY
LigandBDBM92494
Substrate/Competitorn/a
Meas. Tech.Isothermal Titration Calorimetry
Temperature293.15±0 K
Kd 1.09e+5±n/a nM
Citation Lacal, JAlfonso, CLiu, XParales, REMorel, BConejero-Lara, FRivas, GDuque, ERamos, JLKrell, T Identification of a chemoreceptor for tricarboxylic acid cycle intermediates: differential chemotactic response towards receptor ligands. J Biol Chem285:23126-36 (2010) 
 
Methyl-accepting chemotaxis protein NahY
Name:Methyl-accepting chemotaxis protein NahY
Type:Protein
Mol. Mass.:58698.14
Organism:Pseudomonas putida (Arthrobacter siderocapsulatus)
Description:Q9Z429
Residue:538
BDBM92494
NameBDBM92494
Synonyms:Citrate | SODIUM CITRATE
TypeSmall organic molecule
Emp. Form.C6H5O7
Mol. Mass.189.1013
SMILESOC(CC([O-])=O)(CC([O-])=O)C([O-])=O