Reaction Details
TargetEEF1AKMT4-ECE2 readthrough transcript protein
LigandBDBM50251742
Substrate/Competitorn/a
Meas. Tech.Enzymatic Assay
Ki 1.20±0.05 nM
IC50 2.33±0.08 nM
Citation Ouimet, TOrng, SVPoras, HGagnidze, KDevi, LAFournié-Zaluski, MCRoques, BP Identification of an endothelin-converting enzyme-2-specific fluorigenic substrate and development of an in vitro and ex vivo enzymatic assay. J Biol Chem285:34390-400 (2010) 
 
EEF1AKMT4-ECE2 readthrough transcript protein
Name:EEF1AKMT4-ECE2 readthrough transcript protein
Type:Enzyme
Mol. Mass.:99745.05
Organism:Homo sapiens (Human)
Description:P0DPD8
Residue:883
BDBM50251742
NameBDBM50251742
Synonyms:(3R,4R,5R,6S)-3,4,5-trihydroxy-6-methyl-tetrahydro-2H-pyran-2-yl hydrogen (S)-1-((S)-1-(1H-indol-3-yl)-3-oxobutan-2-ylamino)-4-methyl-1-oxopentan-2-ylphosphoramidate (S)-2-{(S)-2-[Hydroxy-((2S,3R,4R,5R,6S)-3,4,5-trihydroxy-6-methyl-tetrahydro-pyran-2-yloxy)-phosphorylamino]-4-methyl-pentanoylamino}-3-(1H-indol-3-yl)-propionic acid (S)-2-{(S)-2-[Hydroxy-(3,4,5-trihydroxy-6-methyl-tetrahydro-pyran-2-yloxy)-phosphorylamino]-4-methyl-1-oxo-pentylamino}-3-(1H-indol-3-yl)-propionic acid (S)-3-(1-Hydroxy-1H-indol-3-yl)-2-{(S)-2-[hydroxy-(3,4,5-trihydroxy-6-methyl-tetrahydro-pyran-2-yloxy)-phosphorylamino]-4-methyl-pentanoylamino}-propionic acid 2-{2-[Hydroxy-(3,4,5-trihydroxy-6-methyl-tetrahydro-pyran-2-yloxy)-phosphorylamino]-4-methyl-pentanoylamino}-3-(1H-indol-3-yl)-propionic acid CHEMBL479579 Phosphoramidon phosphramidon
TypeSmall organic molecule
Emp. Form.C23H34N3O10P
Mol. Mass.543.5039
SMILESCC(C)C[C@H](NP(O)(=O)O[C@@H]1O[C@@H](C)[C@H](O)[C@@H](O)[C@H]1O)C(=O)N[C@@H](Cc1c[nH]c2ccccc12)C(O)=O