Reaction Details
TargetSteroid C26-monooxygenase
LigandBDBM31772
Substrate/Competitorn/a
Meas. Tech.Binding Assay
Kd 4.6e+3± 4e+2 nM
Citation Driscoll, MDMcLean, KJLevy, CMast, NPikuleva, IALafite, PRigby, SELeys, DMunro, AW Structural and biochemical characterization of Mycobacterium tuberculosis CYP142: evidence for multiple cholesterol 27-hydroxylase activities in a human pathogen. J Biol Chem285:38270-82 (2010) 
 
Steroid C26-monooxygenase
Name:Steroid C26-monooxygenase
Type:Enzyme
Mol. Mass.:48425.01
Organism:Mycobacterium tuberculosis
Description:P9WPP0
Residue:433
BDBM31772
NameBDBM31772
Synonyms:1-[2-(2,4-dichlorobenzyl)oxy-2-(2,4-dichlorophenyl)ethyl]imidazole;nitric acid CHEMBL91 Miconazole US9144538, Miconazole Nitrate | cid_4189
TypeSmall organic molecule
Emp. Form.C18H14Cl4N2O
Mol. Mass.416.129
SMILESClc1ccc(COC(Cn2ccnc2)c2ccc(Cl)cc2Cl)c(Cl)c1