Reaction Details
TargetMacrophage migration inhibitory factor
LigandBDBM63895
Substrate/CompetitorBDBM92519
Meas. Tech.Tautomerase Enzyme Assay
pH6.5±0
Ki 1.9e+2±n/a nM
IC50 1.41e+3±n/a nM
Citation Ouertatani-Sakouhi, HEl-Turk, FFauvet, BCho, MKPinar Karpinar, DLe Roy, DDewor, MRoger, TBernhagen, JCalandra, TZweckstetter, MLashuel, HA Identification and characterization of novel classes of macrophage migration inhibitory factor (MIF) inhibitors with distinct mechanisms of action. J Biol Chem285:26581-98 (2010) 
 
Macrophage migration inhibitory factor
Name:Macrophage migration inhibitory factor
Type:Enzyme
Mol. Mass.:12478.18
Organism:Homo sapiens (Human)
Description:P14174
Residue:115
BDBM63895
BDBM92519
NameBDBM63895
Synonyms:7,10-dioxo-4,5-dihydro-7H,10H-pyrano[3,2-c]pyrrolo[3,2,1-ij]quinolin-8-yl 4-fluorobenzoate SMR000459037 | cid_2816532
TypeSmall organic molecule
Emp. Form.C21H12FNO5
Mol. Mass.377.3221
SMILESFc1ccc(cc1)C(=O)Oc1cc(=O)oc2c3cccc4CCn(c34)c(=O)c12