Reaction Details
TargetMacrophage migration inhibitory factor
LigandBDBM92513
Substrate/CompetitorBDBM92519
Meas. Tech.Tautomerase Enzyme Assay
pH6.5±0
Ki 1.81e+3±n/a nM
IC50 1.698e+4±n/a nM
Citation Ouertatani-Sakouhi, HEl-Turk, FFauvet, BCho, MKPinar Karpinar, DLe Roy, DDewor, MRoger, TBernhagen, JCalandra, TZweckstetter, MLashuel, HA Identification and characterization of novel classes of macrophage migration inhibitory factor (MIF) inhibitors with distinct mechanisms of action. J Biol Chem285:26581-98 (2010) 
 
Macrophage migration inhibitory factor
Name:Macrophage migration inhibitory factor
Type:Enzyme
Mol. Mass.:12478.18
Organism:Homo sapiens (Human)
Description:P14174
Residue:115
BDBM92513
BDBM92519
NameBDBM92513
Synonyms:ML 00144, 9
TypeSmall organic molecule
Emp. Form.C15H14N4O3
Mol. Mass.298.2967
SMILESOc1ccc(C=NNC(=O)NN=Cc2ccc(O)cc2)cc1