Reaction Details
TargetGenome polyprotein
LigandBDBM92521
Substrate/Competitorn/a
Meas. Tech.Enzyme Inhibition Assay
pH6.5±0
Temperature298.15±0 K
Ki 4e+2±n/a nM
Citation Lee, CCKuo, CJKo, TPHsu, MFTsui, YCChang, SCYang, SChen, SJChen, HCHsu, MCShih, SRLiang, PHWang, AH Structural basis of inhibition specificities of 3C and 3C-like proteases by zinc-coordinating and peptidomimetic compounds. J Biol Chem284:7646-55 (2009) 
 
Genome polyprotein
Name:Genome polyprotein
Type:Enzyme
Mol. Mass.:243464.96
Organism:Coxsackievirus B3 (strain Nancy)
Description:P03313
Residue:2185
BDBM92521
NameBDBM92521
Synonyms:TG-0205486
TypeOrganic molecule
Emp. Form.C34H50N4O7
Mol. Mass.626.7834
SMILESCC(C)C[C@H](NC(=O)[C@@H](NC(=O)OCc1ccccc1)C(C)OC(C)(C)C)C(=O)NC(C[C@@H]1CCNC1=O)=CCC(=O)C1CC1