Reaction Details
Target2'-deoxynucleoside 5'-phosphate N-hydrolase 1
LigandBDBM92532
Substrate/Competitorn/a
Meas. Tech.Inhibition Assay
Kd 3.33e+4± 1.3e+3 nM
Citation Dupouy, CZhang, CPadilla, APochet, SKaminski, PA Probing the active site of the deoxynucleotide N-hydrolase Rcl encoded by the rat gene c6orf108. J Biol Chem285:41806-14 (2010) 
 
2'-deoxynucleoside 5'-phosphate N-hydrolase 1
Name:2'-deoxynucleoside 5'-phosphate N-hydrolase 1
Type:Enzyme
Mol. Mass.:17775.23
Organism:Rattus norvegicus (Rat)
Description:O35820
Residue:163
BDBM92532
NameBDBM92532
Synonyms:dGMP
TypeSmall molecule
Emp. Form.C10H12N5O7P
Mol. Mass.345.2064
SMILESNc1nc2n(cnc2c(=O)[nH]1)C1CC(O)C(COP([O-])([O-])=O)O1