Reaction Details
TargetCholinesterase
LigandBDBM92545
Substrate/Competitorn/a
Meas. Tech.Inhibition Assay
Ki 61± 5 nM
Citation Raza, RSaeed, AArif, MMahmood, SMuddassar, MRaza, AIqbal, J Synthesis and Biological Evaluation of 3-thiazolocoumarinyl Schiff-base Derivatives as Cholinesterase Inhibitors. Chem Biol Drug Des80:605-15 (2012) 
 
Cholinesterase
Name:Cholinesterase
Type:Homotetramer
Mol. Mass.:68422.27
Organism:Homo sapiens (Human)
Description:P06276
Residue:602
BDBM92545
NameBDBM92545
Synonyms:Coumarin analogue, 3c
TypeSmall molecule
Emp. Form.C19H12ClN3O2S
Mol. Mass.381.835
SMILESClc1ccccc1CN=Nc1nc(cs1)-c1cc2ccccc2oc1=O