Reaction Details
TargetCholinesterase
LigandBDBM92549
Substrate/Competitorn/a
Meas. Tech.Inhibition Assay
Ki 74± 1e+1 nM
Citation Raza, RSaeed, AArif, MMahmood, SMuddassar, MRaza, AIqbal, J Synthesis and Biological Evaluation of 3-thiazolocoumarinyl Schiff-base Derivatives as Cholinesterase Inhibitors. Chem Biol Drug Des80:605-15 (2012) 
 
Cholinesterase
Name:Cholinesterase
Type:Homotetramer
Mol. Mass.:68422.27
Organism:Homo sapiens (Human)
Description:P06276
Residue:602
BDBM92549
NameBDBM92549
Synonyms:Coumarin analogue, 3g
TypeSmall molecule
Emp. Form.C19H12BrN3O2S
Mol. Mass.426.286
SMILESBrc1ccc(CN=Nc2nc(cs2)-c2cc3ccccc3oc2=O)cc1