Reaction Details
TargetCholinesterase
LigandBDBM92553
Substrate/Competitorn/a
Meas. Tech.Inhibition Assay
Ki 72± 6 nM
Citation Raza, RSaeed, AArif, MMahmood, SMuddassar, MRaza, AIqbal, J Synthesis and Biological Evaluation of 3-thiazolocoumarinyl Schiff-base Derivatives as Cholinesterase Inhibitors. Chem Biol Drug Des80:605-15 (2012) 
 
Cholinesterase
Name:Cholinesterase
Type:Homotetramer
Mol. Mass.:68422.27
Organism:Homo sapiens (Human)
Description:P06276
Residue:602
BDBM92553
NameBDBM92553
Synonyms:Coumarin analogue, 3k
TypeSmall molecule
Emp. Form.C21H17N3O5S
Mol. Mass.423.442
SMILESCOc1cc(CN=Nc2nc(cs2)-c2cc3ccccc3oc2=O)cc(OC)c1O