Reaction Details
TargetAromatase
LigandBDBM92557
Substrate/Competitorn/a
Meas. Tech.Aromatase Assay
Ki 0.00255831±0.0 nM
Citation Luqman, SMeena, ASingh, PKondratyuk, TPMarler, LEPezzuto, JMNegi, AS Neoflavonoids and Tetrahydroquinolones as Possible Cancer Chemopreventive Agents. Chem Biol Drug Des80:616-624 (2012) 
 
Aromatase
Name:Aromatase
Type:Enzyme
Mol. Mass.:57888.92
Organism:Homo sapiens (Human)
Description:P11511
Residue:503
BDBM92557
NameBDBM92557
Synonyms:Neoflavonoid, 9
TypeSmall organic molecule
Emp. Form.C20H18O8
Mol. Mass.386.3521
SMILESCOc1cc(cc(OC)c1OC(C)=O)C1CC(=O)Oc2cc3OCOc3cc12