Reaction Details
TargetAromatase
LigandBDBM92559
Substrate/Competitorn/a
Meas. Tech.Aromatase Assay
Ki 0.00425297±0.0 nM
Citation Luqman, SMeena, ASingh, PKondratyuk, TPMarler, LEPezzuto, JMNegi, AS Neoflavonoids and Tetrahydroquinolones as Possible Cancer Chemopreventive Agents. Chem Biol Drug Des80:616-624 (2012) 
 
Aromatase
Name:Aromatase
Type:Enzyme
Mol. Mass.:57888.92
Organism:Homo sapiens (Human)
Description:P11511
Residue:503
BDBM92559
NameBDBM92559
Synonyms:Neoflavonoid, 11
TypeSmall organic molecule
Emp. Form.C20H22O7
Mol. Mass.374.3845
SMILESCOc1cc(OC)c2C(CC(=O)Oc2c1)c1cc(OC)c(OC)c(OC)c1