Reaction Details
TargetAromatase
LigandBDBM92561
Substrate/Competitorn/a
Meas. Tech.Aromatase Assay
Ki 0.0117536±0.0 nM
Citation Luqman, SMeena, ASingh, PKondratyuk, TPMarler, LEPezzuto, JMNegi, AS Neoflavonoids and Tetrahydroquinolones as Possible Cancer Chemopreventive Agents. Chem Biol Drug Des80:616-624 (2012) 
 
Aromatase
Name:Aromatase
Type:Enzyme
Mol. Mass.:57888.92
Organism:Homo sapiens (Human)
Description:P11511
Residue:503
BDBM92561
NameBDBM92561
Synonyms:Neoflavonoid, 20
TypeSmall organic molecule
Emp. Form.C18H17NO6
Mol. Mass.343.3307
SMILESCOc1cc(cc(OC)c1O)C1CC(=O)Nc2cc3OCOc3cc12