Reaction Details
TargetTyrosine-protein kinase ABL1 [1-999,E255K]
LigandBDBM13530
Substrate/Competitorn/a
Meas. Tech.Radiometric Assay
IC50 1200±0 nM
Citation Scutt, PJChu, MLSloane, DACherry, MBignell, CRWilliams, DHEyers, PA Discovery and exploitation of inhibitor-resistant aurora and polo kinase mutants for the analysis of mitotic networks. J Biol Chem284:15880-93 (2009) 
 
Tyrosine-protein kinase ABL1 [1-999,E255K]
Name:Tyrosine-protein kinase ABL1 [1-999,E255K]
Type:Enzyme
Mol. Mass.:108581.57
Organism:Homo sapiens (Human)
Description:n/a
Residue:999
BDBM13530
NameBDBM13530
Synonyms:4-[(4-methylpiperazin-1-yl)methyl]-N-[4-methyl-3-[(4-pyridin-3-ylpyrimidin-2-yl)amino]phenyl]benzamide Gleevec Imatinib, 21 STI-571 US10906896, Cpd imatinib US11725005, Compound imatinib cid_5291 med.21724, Compound 6
TypeSmall organic molecule
Emp. Form.C29H31N7O
Mol. Mass.493.6027
SMILESCN1CCN(Cc2ccc(cc2)C(=O)Nc2ccc(C)c(Nc3nccc(n3)-c3cccnc3)c2)CC1