Reaction Details
TargetSteroid C26-monooxygenase
LigandBDBM31773
Substrate/Competitorn/a
Meas. Tech.Binding Assay
Kd 3.3e+2± 1e+1 nM
Citation Podust, LMOuellet, Hvon Kries, JPde Montellano, PR Interaction of Mycobacterium tuberculosis CYP130 with heterocyclic arylamines. J Biol Chem284:25211-9 (2009) 
 
Steroid C26-monooxygenase
Name:Steroid C26-monooxygenase
Type:Enzyme
Mol. Mass.:41422.72
Organism:Mycobacterium tuberculosis
Description:P9WPL4
Residue:372
BDBM31773
NameBDBM31773
Synonyms:ECONAZOLE Gyno-pevaryl cid_68589
TypeSmall organic molecule
Emp. Form.C18H15Cl3N2O
Mol. Mass.381.684
SMILESClc1ccc(COC(Cn2ccnc2)c2ccc(Cl)cc2Cl)cc1