Reaction Details
TargetGlutamine-dependent NAD(+) synthetase
LigandBDBM92597
Substrate/Competitorn/a
Meas. Tech.Inhibition Assay
pH8.5±0
Temperature310.15±0 K
IC50 2.48e+4± 1.5e+3 nM
Citation Boshoff, HIXu, XTahlan, KDowd, CSPethe, KCamacho, LRPark, THYun, CSSchnappinger, DEhrt, SWilliams, KJBarry, CE Biosynthesis and recycling of nicotinamide cofactors in mycobacterium tuberculosis. An essential role for NAD in nonreplicating bacilli. J Biol Chem283:19329-41 (2008) 
 
Glutamine-dependent NAD(+) synthetase
Name:Glutamine-dependent NAD(+) synthetase
Type:Enzyme
Mol. Mass.:79282.89
Organism:Homo sapiens (Human)
Description:Q6IA69
Residue:706
BDBM92597
NameBDBM92597
Synonyms:CHEMBL324501 | NAD Synthetase Inhibitor, 2
TypeOrganic molecule
Emp. Form.C34H43N2O3
Mol. Mass.527.7163
SMILESC[N+](C)(C)c1ccc(CC(=O)OCCCCCCCCn2ccc3cc(OCc4ccccc4)ccc23)cc1