Reaction Details
TargetGlutamine-dependent NAD(+) synthetase
LigandBDBM92598
Substrate/Competitorn/a
Meas. Tech.Inhibition Assay
pH8.5±0
Temperature310.15±0 K
IC50 6.33e+4± 3.0e+3 nM
Citation Boshoff, HIXu, XTahlan, KDowd, CSPethe, KCamacho, LRPark, THYun, CSSchnappinger, DEhrt, SWilliams, KJBarry, CE Biosynthesis and recycling of nicotinamide cofactors in mycobacterium tuberculosis. An essential role for NAD in nonreplicating bacilli. J Biol Chem283:19329-41 (2008) 
 
Glutamine-dependent NAD(+) synthetase
Name:Glutamine-dependent NAD(+) synthetase
Type:Enzyme
Mol. Mass.:79282.89
Organism:Homo sapiens (Human)
Description:Q6IA69
Residue:706
BDBM92598
NameBDBM92598
Synonyms:NAD Synthetase Inhibitor, 3
TypeOrganic molecule
Emp. Form.C32H37N2O5
Mol. Mass.529.646
SMILESCOC(=O)c1cc2cc(OCc3ccccc3)ccc2n1CCCCCCCOC(=O)Cc1ccc[n+](C)c1