Reaction Details
TargetDihydroorotate dehydrogenase (quinone), mitochondrial [100-517]
LigandBDBM92604
Substrate/Competitorn/a
Meas. Tech.Continuous Assay
IC50 6e+1± 7 nM
Citation Patel, VBooker, MKramer, MRoss, LCelatka, CAKennedy, LMDvorin, JDDuraisingh, MTSliz, PWirth, DFClardy, J Identification and characterization of small molecule inhibitors of Plasmodium falciparum dihydroorotate dehydrogenase. J Biol Chem283:35078-85 (2008) 
 
Dihydroorotate dehydrogenase (quinone), mitochondrial [100-517]
Name:Dihydroorotate dehydrogenase (quinone), mitochondrial [100-517]
Type:Enzyme
Mol. Mass.:47311.25
Organism:Plasmodium berghei
Description:A0A509AEH5[100-517]
Residue:418
BDBM92604
NameBDBM92604
Synonyms:DHOD Inhibitor, 3 | US8703811, 1
TypeSmall molecule
Emp. Form.C17H18N2OS
Mol. Mass.298.403
SMILESCCCNC(=O)c1ccc(s1)-n1c(C)cc2ccccc12