Reaction Details
TargetcGMP-dependent protein kinase 1
LigandBDBM92607
Substrate/Competitorn/a
Meas. Tech.Enzyme Assay
Temperature303.15±0 K
Ki 7.6e+2± 5e+1 nM
Citation Chijiwa, TMishima, AHagiwara, MSano, MHayashi, KInoue, TNaito, KToshioka, THidaka, H Inhibition of forskolin-induced neurite outgrowth and protein phosphorylation by a newly synthesized selective inhibitor of cyclic AMP-dependent protein kinase, N-[2-(p-bromocinnamylamino)ethyl]-5-isoquinolinesulfonamide (H-89), of PC12D pheochromocytoma cells. J Biol Chem265:5267-72 (1990) cGMP-dependent protein kinase 1
Name:cGMP-dependent protein kinase 1
Type:Protein
Mol. Mass.:76358.04
Organism:Homo sapiens (Human)
Description:Q13976
Residue:671
BDBM92607
NameBDBM92607
Synonyms:H-88
TypeSmall Molecule
Emp. Form.C20H21N3O2S
Mol. Mass.367.465
SMILESO=S(=O)(NCCNC\C=C\c1ccccc1)c1cccc2cnccc12