Reaction Details
TargetProtein kinase C alpha type
LigandBDBM15211
Substrate/Competitorn/a
Meas. Tech.Enzyme Assay
Temperature303.15±0 K
Ki 3.17e+4± 1.59e+4 nM
Citation Chijiwa, TMishima, AHagiwara, MSano, MHayashi, KInoue, TNaito, KToshioka, THidaka, H Inhibition of forskolin-induced neurite outgrowth and protein phosphorylation by a newly synthesized selective inhibitor of cyclic AMP-dependent protein kinase, N-[2-(p-bromocinnamylamino)ethyl]-5-isoquinolinesulfonamide (H-89), of PC12D pheochromocytoma cells. J Biol Chem265:5267-72 (1990) Protein kinase C alpha type
Name:Protein kinase C alpha type
Type:Enzyme
Mol. Mass.:76755.65
Organism:Homo sapiens (Human)
Description:The recombinant human PKC enzymes were produced using a baculovirus expression system in SF9 cells
Residue:672
BDBM15211
NameBDBM15211
Synonyms:CHEMBL104264 H89 N-(2-{[(2E)-3-(4-bromophenyl)prop-2-en-1-yl]amino}ethyl)isoquinoline-5-sulfonamide | N-[2-[[(E)-3-(4-bromophenyl)prop-2-enyl]amino]ethyl]isoquinoline-5-sulfonamide
TypeSmall organic molecule
Emp. Form.C20H20BrN3O2S
Mol. Mass.446.361
SMILESBrc1ccc(\C=C\CNCCNS(=O)(=O)c2cccc3cnccc23)cc1