Reaction Details
TargetGenome polyprotein [1658-1692]
LigandBDBM92631
Substrate/Competitorn/a
Meas. Tech.FRET-Based Assay
Temperature298.15±0 K
Kd 24000±n/a nM
Citation Saalau-Bethell, SMWoodhead, AJChessari, GCarr, MGCoyle, JGraham, BHiscock, SDMurray, CWPathuri, PRich, SJRichardson, CJWilliams, PAJhoti, H Discovery of an allosteric mechanism for the regulation of HCV NS3 protein function. Nat Chem Biol8:920-5 (2012) 
 
Genome polyprotein [1658-1692]
Name:Genome polyprotein [1658-1692]
Type:Protein
Mol. Mass.:n/a
Description:n/a
Components:This complex has 2 components.
Component 1
Name:Genome polyprotein
Synonyms:Hepatitis C virus NS3 protease/helicase | Hepatitis C virus serine protease, NS3/NS4A
Type:Protein
Mol. Mass.:67067.41
Organism:Hepatitis C virus
Description:A3EZI9
Residue:631
Component 2
Name:Genome polyprotein [1658-1692]
Synonyms:NS4A Protein | POLG_HCVTW
Type:Protein
Mol. Mass.:3488.19
Organism:Hepatitis C virus
Description:F4YQW6
Residue:35
STWVLVGGVL AALAAYCLTT GSVVIVGRII LSGKP 
BDBM92631
NameBDBM92631
Synonyms:(3R)-3-{[(1S)-1-(4-chloro-2-fluoro-3-phenoxyphenyl)propyl]amino}butanamide, 7
TypeSmall molecule
Emp. Form.C19H22ClFN2O2
Mol. Mass.364.842
SMILESCC[C@H](N[C@H](C)CC(N)=O)c1ccc(Cl)c(Oc2ccccc2)c1F